trends (Qualifier)
modified: 2003-07-25
preferred label: tendances (Qualificatif) @fr
type: Qualifier
type: Concept
created: 1977-05-16
alternative label: TRENDS (Qualifier)
alternative label: TD (Qualifier)
scope note: S'emploie pour traduire la manière dont un sujet évolue, qualitativement ou quantitativement, avec le temps, que ce soit au passé, au présent ou au futur. Il exclut les discussions concernant l'évolution d'une maladie chez des patients particuliers. @fr
scope note: Used for the manner in which a subject changes, qualitatively or quantitatively, with time, whether past, present, or future. It excludes discussions of the course of disease in particular patients.
broader: organization & administration (Qualifier)
in scheme: JVR
established: 1978-01-01

organization & administration (Qualifier)
preferred label: organisation et administration (Qualificatif) @fr
type: Qualifier
type: Concept
narrower: trends (Qualifier)