physiopathology (Qualifier)
broader: JVR-WZF2ZR3L-B
alternative label: PP (Qualifier)
alternative label: PHYSIOPATHOL (Qualifier)
type: Concept
type: Qualifier
modified: 2003-07-22
scope note: S'applique aux organes et aux maladies pour les fonctions altérées dans les états pathologiques. @fr
scope note: Used with organs and diseases for disordered function in disease states.
in scheme: JVR
established: 1966-01-01
preferred label: physiopathologie (Qualificatif) @fr
created: 1973-12-27