diagnostic imaging (Qualifier)
established: 2017-01-01
preferred label: imagerie diagnostique (Qualificatif) @fr
created: 2016-06-29
modified: 2016-06-08
alternative label: DIAG IMAGE (Qualifier)
alternative label: DG (Qualifier)
type: Concept
type: Qualifier
in scheme: JVR
broader: JVR-KRXG97RR-5
scope note: Used for the visualization of an anatomical structure or for the diagnosis of disease. Commonly used imaging techniques include radiography, radionuclide imaging, thermography, tomography, and ultrasonography.
scope note: S'emploie pour la visualisation des structures anatomiques ou pour le diagnostic des maladies. Les techniques d'imagerie couramment utilisées comprennent l'échographie, la radiographie, la scintigraphie, la thermographie et la tomographie. @fr