chemical synthesis (Qualifier)
alternative label: CS (Qualifier)
alternative label: CHEM SYN (Qualifier)
established: 1968-01-01
preferred label: synthèse chimique (Qualificatif) @fr
broader: JVR-D0F21513-5
modified: 2003-07-22
created: 1973-12-27
type: Concept
type: Qualifier
in scheme: JVR
scope note: S'emploie pour la préparation chimique de molécules in vitro. Pour la synthèse de substances chimiques chez les organismes, dans les cellules vivantes ou les fractions subcellulaires, le qualificatif "biosynthèse” est utilisé. @fr
scope note: Used for the chemical preparation of molecules in vitro. For the formation of chemical substances in organisms, living cells, or subcellular fractions, "biosynthesis" is used.