secondary (Qualifier)
preferred label: secondaire (Qualificatif) @fr
type: Qualifier
type: Concept
broader: complications (Qualifier)

etiology (Qualifier)
preferred label: étiologie (Qualificatif) @fr
type: Qualifier
type: Concept
narrower: complications (Qualifier)

complications (Qualifier)
scope note: Used with diseases to indicate conditions that co-exist or follow, i.e., co-existing diseases, complications, or sequelae.
scope note: S'applique aux maladies pour désigner les affections qui apparaissent avec ou à la suite de ces maladies, c’est-à-dire les maladies coexistantes, les complications ou les séquelles. @fr
modified: 2003-07-24
established: 1966-01-01
broader: etiology (Qualifier)
preferred label: complications (Qualificatif) @fr
alternative label: CO (Qualifier)
alternative label: COMPL (Qualifier)
in scheme: JVR
type: Qualifier
type: Concept
narrower: secondary (Qualifier)
created: 1973-12-27