microbiology (Qualifier)
preferred label: microbiologie (Qualificatif) @fr
scope note: S'applique aux organes, aux animaux, aux végétaux supérieurs et aux maladies pour les études microbiologiques. Pour les parasites et les virus, les qualificatifs "parasitologie” et "virologie" sont respectivement utilisés. @fr
scope note: Used with organs, animals, and higher plants and with diseases for microbiologic studies. For parasites, "parasitology" is used; for viruses, "virology" is used.
modified: 2015-07-01
created: 1973-12-27
established: 1967-01-01
in scheme: JVR
alternative label: MI (Qualifier)
alternative label: MICROBIOL (Qualifier)
type: Qualifier
type: Concept
broader: JVR-XVHTZRCG-7
narrower: JVR-P1X8SCQ6-K