injuries (Qualifier)
scope note: S'applique aux régions anatomiques, aux animaux et aux sports pour les blessures et les traumatismes. Il exclut les lésions cellulaires, pour lesquelles le qualificatif "anatomopathologie” est utilisé. @fr
scope note: Used with anatomic headings, animals, and sports for wounds and injuries. Excludes cell damage, for which "pathology" is used.
alternative label: INJ (Qualifier)
alternative label: IN (Qualifier)
preferred label: traumatismes (Qualificatif) @fr
modified: 2003-07-24
in scheme: JVR
type: Concept
type: Qualifier
established: 1966-01-01
top concept of: JVR
created: 1973-12-27