psychology (Qualifier)
in scheme: JVR
type: Qualifier
type: Concept
created: 1977-05-16
preferred label: psychologie (Qualificatif) @fr
scope note: Used with non-psychiatric diseases, techniques, and named groups for psychologic, psychiatric, psychosomatic, psychosocial, behavioral, and emotional aspects, and with psychiatric disease for psychologic aspects; used also with animal terms for animal behavior and psychology.
scope note: S'applique aux maladies non psychiatriques, aux techniques et aux groupes de personnes pour les aspects psychologiques, psychiatriques, psychosomatiques, psychosociaux, comportementaux et émotionnels, ainsi qu'aux maladies psychiatriques pour les aspects psychologiques. Il s'applique également aux animaux pour leur comportement et leur psychologie. @fr
modified: 2003-07-24
alternative label: PSYCHOL (Qualifier)
alternative label: PX (Qualifier)
established: 1978-01-01
top concept of: JVR