agonists (Qualifier)
preferred label: agonistes (Qualificatif) @fr
alternative label: AG (Qualifier)
alternative label: AGON (Qualifier)
scope note: S'applique aux substances chimiques, aux médicaments et aux substances endogènes pour désigner les substances ou les agents ayant une affinité pour un récepteur et une activité intrinsèque au niveau de ce récepteur. @fr
scope note: Used with chemicals, drugs, and endogenous substances to indicate substances or agents that have affinity for a receptor and intrinsic activity at that receptor. (From Textbook of Pharmacology, 1991, p.16).
established: 1995-01-01
broader: JVR-NKM836P1-M
broader: chemistry (Qualifier)
type: Concept
type: Qualifier
in scheme: JVR
modified: 2003-07-22
created: 1994-06-01

chemistry (Qualifier)
preferred label: composition chimique (Qualificatif) @fr
type: Qualifier
type: Concept
narrower: agonists (Qualifier)