poisoning (Qualifier)
preferred label: intoxication (Qualificatif) @fr
type: Qualifier
type: Concept
broader: adverse effects (Qualifier)

therapeutic use (Qualifier)
preferred label: usage thérapeutique (Qualificatif) @fr
type: Qualifier
type: Concept
narrower: adverse effects (Qualifier)

toxicity (Qualifier)
preferred label: toxicité (Qualificatif) @fr
type: Qualifier
type: Concept
broader: adverse effects (Qualifier)

adverse effects (Qualifier)
narrower: poisoning (Qualifier)
narrower: toxicity (Qualifier)
scope note: Used with drugs, chemicals, or biological agents in accepted dosage - or with physical agents or manufactured products in normal usage - when intended for diagnostic, therapeutic, prophylactic, or anesthetic purposes. It is used also for adverse effects or complications of diagnostic, therapeutic, prophylactic, anesthetic, surgical, or other procedures.
scope note: S'applique aux médicaments, aux substances chimiques et aux agents biologiques aux doses communément admises, ainsi qu’aux agents physiques et aux produits manufacturés dans leur usage normal, lors de leur utilisation dans un but diagnostique, thérapeutique, prophylactique ou anesthésique. Il s’emploie aussi pour les effets secondaires et les complications des procédures diagnostiques, thérapeutiques, prophylactiques, anesthésiques, chirurgicales ou autres. @fr
broader: therapeutic use (Qualifier)
broader: JVR-NKM836P1-M
type: Qualifier
type: Concept
created: 1973-12-27
in scheme: JVR
preferred label: effets indésirables (Qualificatif) @fr
alternative label: AE (Qualifier)
alternative label: ADV EFF (Qualifier)
established: 1966-01-01
modified: 2017-07-05