drug effects (Qualifier)
top concept of: JVR
type: Qualifier
type: Concept
alternative label: DE (Qualifier)
alternative label: DRUG EFF (Qualifier)
modified: 2003-07-22
created: 1973-12-27
scope note: Used with organs, regions, tissues, or organisms and physiological and psychological processes for the effects of drugs and chemicals.
scope note: S'applique aux organes, aux régions anatomiques, aux tissus et aux organismes, ainsi qu’aux processus physiologiques ou psychologiques pour les effets des médicaments et des substances chimiques. @fr
in scheme: JVR
preferred label: effets des médicaments et des substances chimiques (Qualificatif) @fr
established: 1966-01-01