antagonists & inhibitors (Qualifier)
in scheme: JVR
preferred label: antagonistes et inhibiteurs (Qualificatif) @fr
type: Concept
type: Qualifier
broader: JVR-NKM836P1-M
broader: JVR-D0F21513-5
alternative label: AI (Qualifier)
alternative label: ANTAG (Qualifier)
scope note: Used with chemicals, drugs, and endogenous substances to indicate substances or agents which counteract their biological effects by any mechanism.
scope note: S'applique aux substances chimiques, aux médicaments et aux substances endogènes pour désigner les substances ou les agents qui neutralisent leurs effets biologiques par un mécanisme quelconque. @fr
modified: 2017-04-11
established: 1968-01-01
created: 1973-12-27