diagnostic imaging (Qualifier)
preferred label: imagerie diagnostique (Qualificatif) @fr
type: Qualifier
type: Concept
broader: diagnosis (Qualifier)

diagnosis (Qualifier)
created: 1973-12-27
top concept of: JVR
modified: 2017-04-11
established: 1966-01-01
preferred label: diagnostic (Qualificatif) @fr
scope note: Used with diseases for all aspects of diagnosis, including examination, differential diagnosis and prognosis. Excludes diagnosis using imaging techniques (e.g. radiography, scintigraphy, and ultrasonography) for which "diagnostic imaging" is used.
scope note: S'applique aux maladies pour les différents aspects du diagnostic, y compris l'examen, le diagnostic différentiel et le pronostic. Il exclut le diagnostic utilisant des techniques d’imagerie (l’échographie, la radiographie et la scintigraphie, par exemple), pour lequel le qualificatif "imagerie diagnostique" est utilisé. @fr
alternative label: DIAG (Qualifier)
alternative label: DI (Qualifier)
type: Qualifier
type: Concept
in scheme: JVR
narrower: diagnostic imaging (Qualifier)