methods (Qualifier)
type: Qualifier
type: Concept
created: 1974-10-23
preferred label: méthodes (Qualificatif) @fr
alternative label: MT (Qualifier)
alternative label: METHODS (Qualifier)
in scheme: JVR
top concept of: JVR
scope note: Used with techniques, procedures, and programs for methods.
scope note: S'applique aux techniques, aux procédures et aux programmes pour les méthodes. @fr
modified: 2003-07-24
established: 1975-01-01