nursing (Qualifier)
created: 1973-12-27
type: Qualifier
type: Concept
modified: 2003-07-24
scope note: S'applique aux maladies pour les soins infirmiers et les techniques liées à leur prise en charge. Il comprend le rôle infirmier dans les procédures diagnostiques, thérapeutiques et préventives. @fr
scope note: Used with diseases for nursing care and techniques in their management. It includes the nursing role in diagnostic, therapeutic, and preventive procedures.
established: 1966-01-01
alternative label: NU (Qualifier)
alternative label: NURS (Qualifier)
preferred label: soins infirmiers (Qualificatif) @fr
in scheme: JVR
broader: JVR-BQ3W1P91-F