rehabilitation (Qualifier)
alternative label: REHABIL (Qualifier)
alternative label: RH (Qualifier)
scope note: Used with diseases and surgical procedures for restoration of function of the individual.
scope note: S'applique aux maladies et aux procédures chirurgicales pour la récupération d'une fonction chez un individu. @fr
type: Qualifier
type: Concept
established: 1967-01-01
preferred label: rééducation et réadaptation (Qualificatif) @fr
modified: 2003-07-22
created: 1973-12-27
broader: therapy (Qualifier)
in scheme: JVR

therapy (Qualifier)
preferred label: thérapie (Qualificatif) @fr
type: Qualifier
type: Concept
narrower: rehabilitation (Qualifier)