radiation effects (Qualifier)
type: Qualifier
type: Concept
alternative label: RE (Qualifier)
alternative label: RAD EFF (Qualifier)
preferred label: effets des radiations (Qualificatif) @fr
modified: 2003-07-22
scope note: Used for effects of ionizing and nonionizing radiation upon living organisms, organs and tissues, and their constituents, and upon physiologic processes. It includes the effect of irradiation on drugs and chemicals.
scope note: S'emploie pour les effets des radiations ionisantes ou non ionisantes sur les organismes vivants, les organes, les tissus et leurs constituants, ainsi que sur les processus physiologiques. Il inclut les effets de l'irradiation sur les médicaments et les substances chimiques. @fr
in scheme: JVR
established: 1966-01-01
top concept of: JVR
created: 1973-12-27