therapeutic use (Qualifier)
alternative label: TU (Qualifier)
alternative label: THER USE (Qualifier)
narrower: adverse effects (Qualifier)
narrower: JVR-TJHVZCRZ-0
established: 1966-01-01
created: 1973-12-27
scope note: S'applique aux médicaments, aux préparations biologiques et aux agents physiques pour leur utilisation dans la prévention et le traitement des maladies. Il inclut l’utilisation vétérinaire. @fr
scope note: Used with drugs, biological preparations, and physical agents for their use in the prophylaxis and treatment of disease. It includes veterinary use.
top concept of: JVR
in scheme: JVR
type: Concept
type: Qualifier
preferred label: usage thérapeutique (Qualificatif) @fr
modified: 2004-07-13

adverse effects (Qualifier)
preferred label: effets indésirables (Qualificatif) @fr
type: Qualifier
type: Concept
broader: therapeutic use (Qualifier)