ethnology (Qualifier)
preferred label: ethnologie (Qualificatif) @fr
type: Qualifier
type: Concept
broader: epidemiology (Qualifier)

statistics & numerical data (Qualifier)
preferred label: statistiques et données numériques (Qualificatif) @fr
type: Qualifier
type: Concept
narrower: epidemiology (Qualifier)

epidemiology (Qualifier)
narrower: mortality (Qualifier)
narrower: ethnology (Qualifier)
alternative label: EP (Qualifier)
alternative label: EPIDEMIOL (Qualifier)
scope note: Used with human and veterinary diseases for the distribution of disease, factors which cause disease, and the attributes of disease in defined populations; includes incidence, frequency, prevalence, endemic and epidemic outbreaks; also surveys and estimates of morbidity in geographic areas and in specified populations. Used also with geographical headings for the location of epidemiologic aspects of a disease. Excludes mortality for which "mortality" is used.
scope note: S'applique aux maladies humaines ou animales pour leur distribution, leurs facteurs étiologiques et leurs caractéristiques dans des populations définies. Il inclut l'incidence, la fréquence, la prévalence, ainsi que les foyers d’endémie et d’épidémie. Il comprend également les enquêtes et les estimations de la morbidité en fonction des zones géographiques et des populations. Il s'applique aussi aux descripteurs géographiques pour la localisation des aspects épidémiologiques d'une maladie. Il exclut la mortalité, pour laquelle le qualificatif "mortalité" est utilisé. @fr
created: 1973-12-27
preferred label: épidémiologie (Qualificatif) @fr
type: Concept
type: Qualifier
established: 1966-01-01
modified: 2004-07-13
in scheme: JVR
broader: statistics & numerical data (Qualifier)

mortality (Qualifier)
preferred label: mortalité (Qualificatif) @fr
type: Qualifier
type: Concept
broader: epidemiology (Qualifier)