cerebrospinal fluid (Qualifier)
type: Concept
type: Qualifier
established: 1967-01-01
modified: 2003-07-22
scope note: S'emploie pour la présence de substances dans le liquide cérébrospinal ou leur analyse, ainsi que pour l'examen ou les modifications du liquide cérébrospinal dans les états pathologiques. @fr
scope note: Used for the presence or analysis of substances in the cerebrospinal fluid; also for examination of or changes in cerebrospinal fluid in disease states.
alternative label: liquide céphalorachidien (Qualificatif) @fr
alternative label: CSF (Qualifier)
alternative label: CF (Qualifier)
in scheme: JVR
preferred label: liquide cérébrospinal (Qualificatif) @fr
created: 1973-12-27
broader: JVR-L6C0XPHT-4
broader: JVR-Q3979798-W