complications (Qualifier)
type: Qualifier
preferred label: complications (Qualificatif) @fr
type: Concept
narrower: secondary (Qualifier)

secondary (Qualifier)
type: Concept
in scheme: JVR
alternative label: SECOND (Qualifier)
alternative label: SC (Qualifier)
type: Qualifier
established: 1980-01-01
broader: complications (Qualifier)
scope note: Used with neoplasms to indicate the secondary location to which the neoplastic process has metastasized.
scope note: S’applique aux tumeurs pour désigner les localisations secondaires résultant du processus métastatique. @fr
preferred label: secondaire (Qualificatif) @fr
modified: 2003-07-22
created: 1979-05-24