etiology (Qualifier)
type: Qualifier
preferred label: étiologie (Qualificatif) @fr
type: Concept
narrower: transmission (Qualifier)

transmission (Qualifier)
type: Concept
scope note: S'applique aux maladies pour les études concernant leurs modes de transmission. @fr
scope note: Used with diseases for studies of the modes of transmission.
alternative label: TM (Qualifier)
alternative label: TRANSM (Qualifier)
in scheme: JVR
preferred label: transmission (Qualificatif) @fr
established: 1975-01-01
modified: 2003-07-22
created: 1974-10-23
type: Qualifier
broader: etiology (Qualifier)