education (Qualifier)
type: Concept
preferred label: enseignement et éducation (Qualificatif) @fr
established: 1967-01-01
scope note: Used for education, training programs, and courses in various fields and disciplines, and for training groups of persons.
scope note: S'emploie pour l'enseignement, les programmes de formation et les cours dans divers champs et disciplines, ainsi que pour les groupes de personnes en formation. @fr
alternative label: ED (Qualifier)
alternative label: EDUC (Qualifier)
top concept of: JVR
type: Qualifier
modified: 2003-07-24
created: 1973-12-27
in scheme: JVR