transplantation (Qualifier)
type: Qualifier
preferred label: transplantation (Qualificatif) @fr
type: Concept
broader: surgery (Qualifier)

surgery (Qualifier)
type: Qualifier
narrower: transplantation (Qualifier)
established: 1966-01-01
created: 1973-12-27
alternative label: SU (Qualifier)
alternative label: SURG (Qualifier)
in scheme: JVR
scope note: Used for operative procedures on organs, regions, or tissues in the treatment of diseases, including tissue section by lasers. It excludes transplantation, for which "transplantation" is used.
scope note: S'emploie pour les actes chirurgicaux pratiqués dans un but thérapeutique sur les organes, les régions anatomiques ou les tissus, y compris la section tissulaire par laser. Il exclut la transplantation, pour laquelle le qualificatif "transplantation" est utilisé. @fr
type: Concept
preferred label: chirurgie (Qualificatif) @fr
modified: 2003-07-24
broader: therapy (Qualifier)

therapy (Qualifier)
type: Qualifier
preferred label: thérapie (Qualificatif) @fr
type: Concept
narrower: surgery (Qualifier)