supply & distribution (Qualifier)
type: Qualifier
preferred label: ressources et distribution (Qualificatif) @fr
type: Concept
broader: statistics & numerical data (Qualifier)

statistics & numerical data (Qualifier)
type: Qualifier
preferred label: statistiques et données numériques (Qualificatif) @fr
type: Concept
established: 1989-01-01
narrower: epidemiology (Qualifier)
narrower: supply & distribution (Qualifier)
alternative label: STATIST (Qualifier)
alternative label: SN (Qualifier)
top concept of: JVR
in scheme: JVR
scope note: S'applique aux descripteurs autres que ceux de maladies pour exprimer les valeurs numériques décrivant des ensembles ou groupes particuliers de données. Il exclut la demande, pour laquelle le qualificatif "ressources et distribution" est employé. @fr
scope note: Used with non-disease headings for the expression of numerical values which describe particular sets or groups of data. It excludes demand for which "supply & distribution" is used.
created: 1988-06-02
modified: 2018-07-12

epidemiology (Qualifier)
type: Qualifier
preferred label: épidémiologie (Qualificatif) @fr
type: Concept
broader: statistics & numerical data (Qualifier)