innervation (Qualifier)
type: Qualifier
type: Concept
alternative label: IR (Qualifier)
alternative label: INNERV (Qualifier)
scope note: Used with organs, regions, or tissues for their nerve supply.
scope note: S'applique aux organes, aux régions anatomiques et aux tissus pour leur innervation. @fr
broader: anatomy & histology (Qualifier)
established: 1966-01-01
preferred label: innervation (Qualificatif) @fr
created: 1973-12-27
in scheme: JVR
modified: 2003-07-22

anatomy & histology (Qualifier)
type: Qualifier
preferred label: anatomie et histologie (Qualificatif) @fr
type: Concept
narrower: innervation (Qualifier)