surgery (Qualifier)
type: Qualifier
preferred label: chirurgie (Qualificatif) @fr
type: Concept
narrower: transplantation (Qualifier)

transplantation (Qualifier)
type: Concept
scope note: Used with organs, tissues, or cells for transplantation from one site to another within the same subject, or from one subject to another of the same species or different species.
scope note: S'applique aux organes, aux tissus ou aux cellules pour leur transfert d'un emplacement à un autre chez un même individu, ainsi que pour leur transfert d'un individu à un autre de la même espèce ou d'une espèce différente. @fr
preferred label: transplantation (Qualificatif) @fr
established: 1966-01-01
broader: surgery (Qualifier)
created: 1973-12-27
alternative label: TR (Qualifier)
alternative label: TRANSPL (Qualifier)
modified: 2003-07-24
type: Qualifier
in scheme: JVR