embryology (Qualifier)
type: Concept
modified: 2003-07-24
narrower: abnormalities (Qualifier)
established: 1966-01-01
created: 1973-12-27
in scheme: JVR
alternative label: EMBRYOL (Qualifier)
alternative label: EM (Qualifier)
broader: etiology (Qualifier)
broader: anatomy & histology (Qualifier)
preferred label: embryologie (Qualificatif) @fr
scope note: S'applique aux organes, aux régions anatomiques et aux animaux pour leurs développements embryonnaire et fœtal. Il s'applique aussi aux maladies pour les facteurs embryologiques contribuant aux troubles postnatals. @fr
scope note: Used with organs, regions, and animal headings for embryologic and fetal development. It is used also with diseases for embryologic factors contributing to postnatal disorders.
type: Qualifier

abnormalities (Qualifier)
type: Qualifier
preferred label: malformations (Qualificatif) @fr
type: Concept
broader: embryology (Qualifier)

etiology (Qualifier)
type: Qualifier
preferred label: étiologie (Qualificatif) @fr
type: Concept
narrower: embryology (Qualifier)

anatomy & histology (Qualifier)
type: Qualifier
preferred label: anatomie et histologie (Qualificatif) @fr
type: Concept
narrower: embryology (Qualifier)