ethnology (Qualifier)
type: Qualifier
established: 1975-01-01
in scheme: JVR
alternative label: EH (Qualifier)
alternative label: ETHNOL (Qualifier)
preferred label: ethnologie (Qualificatif) @fr
created: 1974-10-23
type: Concept
scope note: S'applique aux maladies pour les aspects ethniques, culturels ou anthropologiques, ainsi qu'aux descripteurs géographiques pour indiquer le lieu d'origine d'un groupe de personnes. @fr
scope note: Used with diseases for ethnic, cultural, or anthropological aspects, and with geographic headings to indicate the place of origin of a group of people.
modified: 2015-07-01
broader: epidemiology (Qualifier)

epidemiology (Qualifier)
type: Qualifier
preferred label: épidémiologie (Qualificatif) @fr
type: Concept
narrower: ethnology (Qualifier)