abnormalities (Qualifier)
type: Qualifier
created: 1973-12-27
modified: 2015-07-01
alternative label: AB (Qualifier)
alternative label: ABNORM (Qualifier)
established: 1966-01-01
preferred label: malformations (Qualificatif) @fr
scope note: Used with organs for congenital defects producing changes in the morphology of the organ. It is used also for abnormalities in animals.
scope note: S'applique aux organes pour les anomalies congénitales responsables de modifications morphologiques de ces organes. Il s’emploie aussi pour les malformations chez les animaux. @fr
in scheme: JVR
broader: embryology (Qualifier)
type: Concept

embryology (Qualifier)
type: Qualifier
preferred label: embryologie (Qualificatif) @fr
type: Concept
narrower: abnormalities (Qualifier)