ethics (Qualifier)
type: Concept
preferred label: éthique (Qualificatif) @fr
top concept of: JVR
scope note: Used with techniques and activities for discussion and analysis with respect to human and social values.
scope note: S'applique aux techniques et aux activités pour les débats et les analyses concernant les valeurs humaines et sociales. @fr
type: Qualifier
alternative label: ES (Qualifier)
alternative label: ETHICS (Qualifier)
established: 2003-01-01
modified: 2004-07-13
created: 2002-07-02
in scheme: JVR