etiology (Qualifier)
type: Qualifier
preferred label: étiologie (Qualificatif) @fr
type: Concept
narrower: congenital (Qualifier)

congenital (Qualifier)
type: Qualifier
scope note: Used with disease headings to indicate those conditions existing at, and usually before, birth. It excludes morphologic abnormalities and birth injuries, for which "abnormalities" and "injuries" are used.
scope note: S'applique aux maladies pour indiquer les affections existant à la naissance et généralement avant. Il exclut les malformations et les traumatismes obstétricaux, pour lesquels les qualificatifs "malformations” et "traumatismes” sont respectivement utilisés. @fr
modified: 2003-07-22
alternative label: CONGEN (Qualifier)
alternative label: CN (Qualifier)
created: 1973-12-27
preferred label: congénital (Qualificatif) @fr
type: Concept
broader: etiology (Qualifier)
in scheme: JVR
established: 1966-01-01