growth & development (Qualifier)
type: Concept
scope note: Used with microorganisms, plants, and the postnatal period of animals for growth and development. It includes also the postnatal growth or development of organs or anatomical parts.
scope note: S'applique aux micro-organismes, aux végétaux et aux animaux en période postnatale pour leur croissance et leur développement. Il comprend aussi la croissance et le développement postnatals des organes et des régions anatomiques. @fr
type: Qualifier
modified: 2017-04-11
broader: physiology (Qualifier)
created: 1973-12-27
preferred label: croissance et développement (Qualificatif) @fr
alternative label: GROWTH (Qualifier)
alternative label: GD (Qualifier)
established: 1966-01-01
in scheme: JVR

physiology (Qualifier)
type: Qualifier
preferred label: physiologie (Qualificatif) @fr
type: Concept
narrower: growth & development (Qualifier)