poisoning (Qualifier)
type: Qualifier
alternative label: POIS (Qualifier)
alternative label: PO (Qualifier)
preferred label: intoxication (Qualificatif) @fr
type: Concept
modified: 2017-07-05
scope note: Used with drugs, chemicals, and industrial materials for human or animal poisoning, acute or chronic, whether the poisoning is accidental, occupational, suicidal, by medication error, or by environmental exposure.
scope note: S'applique aux médicaments, aux substances chimiques et aux matériaux industriels pour une intoxication humaine ou animale, aiguë ou chronique, qu'elle soit accidentelle, professionnelle, suicidaire, due à une erreur de médication ou à une exposition environnementale. @fr
created: 1973-12-27
established: 1966-01-01
broader: adverse effects (Qualifier)
in scheme: JVR

adverse effects (Qualifier)
type: Qualifier
preferred label: effets indésirables (Qualificatif) @fr
type: Concept
narrower: poisoning (Qualifier)