antagonists & inhibitors (Qualifier)
type: Concept
in scheme: JVR
preferred label: antagonistes et inhibiteurs (Qualificatif) @fr
type: Qualifier
broader: pharmacology (Qualifier)
broader: chemistry (Qualifier)
alternative label: AI (Qualifier)
alternative label: ANTAG (Qualifier)
scope note: Used with chemicals, drugs, and endogenous substances to indicate substances or agents which counteract their biological effects by any mechanism.
scope note: S'applique aux substances chimiques, aux médicaments et aux substances endogènes pour désigner les substances ou les agents qui neutralisent leurs effets biologiques par un mécanisme quelconque. @fr
modified: 2017-04-11
established: 1968-01-01
created: 1973-12-27

pharmacology (Qualifier)
type: Qualifier
preferred label: pharmacologie (Qualificatif) @fr
type: Concept
narrower: antagonists & inhibitors (Qualifier)

chemistry (Qualifier)
type: Qualifier
preferred label: composition chimique (Qualificatif) @fr
type: Concept
narrower: antagonists & inhibitors (Qualifier)