veterinary (Qualifier)
type: Concept
alternative label: VET (Qualifier)
alternative label: VE (Qualifier)
scope note: Used for naturally occurring diseases in animals, or for diagnostic, preventive, or therapeutic procedures used in veterinary medicine.
scope note: S'emploie pour les maladies naturelles chez les animaux, ainsi que pour les procédures diagnostiques, préventives ou thérapeutiques utilisées en médecine vétérinaire. @fr
preferred label: médecine vétérinaire (Qualificatif) @fr
type: Qualifier
modified: 2003-07-22
established: 1966-01-01
created: 1973-12-27
top concept of: JVR
in scheme: JVR