anatomy & histology (Qualifier)
type: Qualifier
preferred label: anatomie et histologie (Qualificatif) @fr
type: Concept
narrower: blood supply (Qualifier)

blood supply (Qualifier)
type: Qualifier
scope note: S'emploie pour les systèmes artériel, capillaire et veineux d'un organe ou d'une région anatomique quand il n'existe pas de descripteur spécifique du vaisseau concerné. Il s’emploie aussi pour le débit sanguin dans un organe. @fr
scope note: Used for arterial, capillary, and venous systems of an organ or region whenever the specific heading for the vessel does not exist. It includes blood flow through the organ.
preferred label: vascularisation (Qualificatif) @fr
type: Concept
alternative label: BS (Qualifier)
alternative label: BLOOD SUPPLY (Qualifier)
established: 1966-01-01
broader: anatomy & histology (Qualifier)
created: 1973-12-27
modified: 2003-07-24
in scheme: JVR