pathogenicity (Qualifier)
type: Concept
top concept of: JVR
preferred label: pathogénicité (Qualificatif) @fr
modified: 2003-07-24
established: 1966-01-01
alternative label: PATHOGEN (Qualifier)
alternative label: PY (Qualifier)
scope note: Used with microorganisms, viruses, and parasites for studies of their ability to cause disease in man, animals, or plants.
scope note: S'applique aux micro-organismes, aux virus et aux parasites pour les études de leur capacité à provoquer une maladie chez l'homme, les animaux ou les végétaux. @fr
type: Qualifier
created: 1973-12-27
in scheme: JVR