instrumentation (Qualifier)
type: Qualifier
scope note: Used with diagnostic or therapeutic procedures, analytic techniques, and specialties or disciplines, for the development or modification of apparatus, instruments, or equipment.
scope note: S'applique aux procédures diagnostiques ou thérapeutiques, aux techniques analytiques, aux spécialités ou aux disciplines, pour le développement ou les modifications d'appareils, d'instruments ou d'équipement. @fr
alternative label: IS (Qualifier)
alternative label: INSTRUM (Qualifier)
preferred label: instrumentation (Qualificatif) @fr
modified: 2003-07-24
in scheme: JVR
established: 1966-01-01
created: 1973-12-27
top concept of: JVR
type: Concept