chemistry (Qualifier)
type: Qualifier
preferred label: composition chimique (Qualificatif) @fr
type: Concept
narrower: analogs & derivatives (Qualifier)

analogs & derivatives (Qualifier)
type: Qualifier
in scheme: JVR
preferred label: analogues et dérivés (Qualificatif) @fr
modified: 2017-04-11
scope note: Used with drugs and chemicals for substances that share the same parent molecule or have similar electronic structure but differ by the addition or substitution of other atoms or molecules. It is used when the specific chemical heading is not available and no appropriate group heading exists.
scope note: S'applique aux médicaments et aux substances chimiques pour les substances qui dérivent de la même molécule ou qui ont des structures électroniques similaires, mais qui diffèrent par l'addition ou la substitution d'atomes ou de molécules. Il s'emploie quand il n'existe pas de descripteur chimique spécifique ou de descripteur de groupe approprié. @fr
alternative label: ANALOGS (Qualifier)
alternative label: AA (Qualifier)
type: Concept
established: 1975-01-01
created: 1974-10-23
broader: chemistry (Qualifier)