toxicity (Qualifier)
type: Qualifier
alternative label: TOX (Qualifier)
alternative label: TO (Qualifier)
established: 1966-01-01
preferred label: toxicité (Qualificatif) @fr
in scheme: JVR
scope note: Used with drugs and chemicals for experimental human and animal studies of their ill effects. It includes studies to determine the margin of safety or the reactions accompanying administration at various dose levels. It is used also for exposure to environmental agents. Poisoning should be considered for life-threatening exposure to environmental agents.
scope note: S'applique aux médicaments et aux substances chimiques pour les études expérimentales de leurs effets néfastes chez l'homme et l'animal. Il inclut les études de détermination des marges de sécurité ou des réactions accompagnant leur administration à différentes doses. Il s’emploie aussi pour l'exposition aux agents environnementaux. Pour l’exposition à des agents environnementaux entraînant un risque vital, le qualificatif "intoxication" est utilisé. @fr
type: Concept
modified: 2017-07-05
broader: adverse effects (Qualifier)
created: 1973-12-27

adverse effects (Qualifier)
type: Qualifier
preferred label: effets indésirables (Qualificatif) @fr
type: Concept
narrower: toxicity (Qualifier)