anatomy & histology (Qualifier)
type: Qualifier
preferred label: anatomie et histologie (Qualificatif) @fr
type: Concept
narrower: pathology (Qualifier)

pathology (Qualifier)
type: Qualifier
preferred label: anatomopathologie (Qualificatif) @fr
alternative label: PA (Qualifier)
alternative label: PATHOL (Qualifier)
alternative label: anatomie pathologique (Qualificatif) @fr
type: Concept
established: 1966-01-01
scope note: Used for organ, tissue, or cell structure in disease states.
scope note: S'emploie pour la structure des organes, des tissus ou des cellules dans les états pathologiques. @fr
created: 1973-12-27
in scheme: JVR
modified: 2016-06-15
broader: anatomy & histology (Qualifier)