metabolism (Qualifier)
type: Qualifier
preferred label: métabolisme (Qualificatif) @fr
type: Concept
narrower: deficiency (Qualifier)

deficiency (Qualifier)
type: Qualifier
scope note: Used with endogenous and exogenous substances which are absent or in diminished amount relative to the normal requirement of an organism or a biologic system.
scope note: S'applique aux substances endogènes ou exogènes qui sont absentes ou en quantité réduite par rapport aux besoins normaux d'un organisme ou d'un système biologique. @fr
alternative label: DF (Qualifier)
alternative label: DEFIC (Qualifier)
in scheme: JVR
created: 1974-10-23
modified: 2003-07-22
preferred label: déficit (Qualificatif) @fr
type: Concept
broader: metabolism (Qualifier)
established: 1975-01-01