etiology (Qualifier)
type: Qualifier
preferred label: étiologie (Qualificatif) @fr
type: Concept
narrower: chemically induced (Qualifier)

chemically induced (Qualifier)
type: Qualifier
alternative label: CI (Qualifier)
alternative label: CHEM IND (Qualifier)
scope note: S'emploie pour les phénomènes biologiques, les maladies, les syndromes, les malformations congénitales et les symptômes provoqués par des substances endogènes ou exogènes. @fr
scope note: Used for biological phenomena, diseases, syndromes, congenital abnormalities, or symptoms caused by endogenous or exogenous substances.
in scheme: JVR
preferred label: induit chimiquement (Qualificatif) @fr
established: 1967-01-01
modified: 2003-07-22
type: Concept
broader: etiology (Qualifier)
created: 1973-12-27