epidemiology (Qualifier)
type: Qualifier
type: Concept
broader: statistics & numerical data (Qualifier)
preferred label: épidémiologie (Qualificatif) @fr

supply & distribution (Qualifier)
type: Qualifier
type: Concept
broader: statistics & numerical data (Qualifier)
preferred label: ressources et distribution (Qualificatif) @fr

statistics & numerical data (Qualifier)
type: Qualifier
type: Concept
created: 1988-06-02
established: 1989-01-01
modified: 2018-07-12
alternative label: STATIST (Qualifier)
alternative label: SN (Qualifier)
in scheme: JVR
narrower: epidemiology (Qualifier)
narrower: supply & distribution (Qualifier)
preferred label: statistiques et données numériques (Qualificatif) @fr
scope note: S'applique aux descripteurs autres que ceux de maladies pour exprimer les valeurs numériques décrivant des ensembles ou groupes particuliers de données. Il exclut la demande, pour laquelle le qualificatif "ressources et distribution" est employé. @fr
scope note: Used with non-disease headings for the expression of numerical values which describe particular sets or groups of data. It excludes demand for which "supply & distribution" is used.
top concept of: JVR