therapy (Qualifier)
type: Qualifier
type: Concept
narrower: diet therapy (Qualifier)
preferred label: thérapie (Qualificatif) @fr

diet therapy (Qualifier)
type: Concept
type: Qualifier
created: 1974-10-23
established: 1975-01-01
modified: 2015-12-15
alternative label: DIET THER (Qualifier)
alternative label: DH (Qualifier)
alternative label: thérapie diététique (Qualificatif) @fr
broader: therapy (Qualifier)
in scheme: JVR
preferred label: diétothérapie (Qualificatif) @fr
scope note: S'applique aux maladies pour leur prise en charge alimentaire ou nutritionnelle. Il exclut la supplémentation vitaminique ou minérale, pour laquelle le qualificatif "traitement médicamenteux" est utilisé. @fr
scope note: Used with disease headings for dietary and nutritional management of the disease. The concept does not include vitamin or mineral supplements, for which "drug therapy" may be used.