anatomy & histology (Qualifier)
type: Qualifier
type: Concept
narrower: cytology (Qualifier)
preferred label: anatomie et histologie (Qualificatif) @fr

ultrastructure (Qualifier)
type: Qualifier
type: Concept
broader: cytology (Qualifier)
preferred label: ultrastructure (Qualificatif) @fr

cytology (Qualifier)
type: Qualifier
type: Concept
created: 1973-12-27
established: 1967-01-01
modified: 2004-07-09
alternative label: CYTOL (Qualifier)
alternative label: CY (Qualifier)
broader: anatomy & histology (Qualifier)
in scheme: JVR
narrower: ultrastructure (Qualifier)
preferred label: cytologie (Qualificatif) @fr
scope note: S'emploie pour la morphologie cellulaire des organismes unicellulaires ou pluricellulaires. @fr
scope note: Used for cellular appearance of unicellular and multicellular organisms.