epidemiology (Qualifier)
type: Qualifier
type: Concept
narrower: mortality (Qualifier)
preferred label: épidémiologie (Qualificatif) @fr

mortality (Qualifier)
type: Concept
type: Qualifier
created: 1973-12-27
established: 1967-01-01
modified: 2004-07-13
alternative label: MORTAL (Qualifier)
alternative label: MO (Qualifier)
broader: epidemiology (Qualifier)
in scheme: JVR
preferred label: mortalité (Qualificatif) @fr
scope note: Used with human and veterinary diseases for mortality statistics. For deaths resulting from various procedures statistically but for a death resulting in a specific case, use FATAL OUTCOME, not /mortality.
scope note: S'applique aux maladies humaines ou animales pour les statistiques de mortalité. Pour un décès dans un cas particulier, c’est le descripteur "Issue fatale" qui est utilisé et non le qualificatif "mortalité". @fr