chemistry (Qualifier)
type: Qualifier
type: Concept
narrower: agonists (Qualifier)
preferred label: composition chimique (Qualificatif) @fr

pharmacology (Qualifier)
type: Qualifier
type: Concept
narrower: agonists (Qualifier)
preferred label: pharmacologie (Qualificatif) @fr

agonists (Qualifier)
type: Concept
type: Qualifier
created: 1994-06-01
established: 1995-01-01
modified: 2003-07-22
alternative label: AG (Qualifier)
alternative label: AGON (Qualifier)
broader: pharmacology (Qualifier)
broader: chemistry (Qualifier)
in scheme: JVR
preferred label: agonistes (Qualificatif) @fr
scope note: S'applique aux substances chimiques, aux médicaments et aux substances endogènes pour désigner les substances ou les agents ayant une affinité pour un récepteur et une activité intrinsèque au niveau de ce récepteur. @fr
scope note: Used with chemicals, drugs, and endogenous substances to indicate substances or agents that have affinity for a receptor and intrinsic activity at that receptor. (From Textbook of Pharmacology, 1991, p.16).