organization & administration (Qualifier)
type: Qualifier
type: Concept
narrower: legislation & jurisprudence (Qualifier)
preferred label: organisation et administration (Qualificatif) @fr

legislation & jurisprudence (Qualifier)
type: Qualifier
type: Concept
created: 1977-05-16
established: 1978-01-01
modified: 2017-04-11
alternative label: LJ (Qualifier)
alternative label: LEGIS (Qualifier)
broader: organization & administration (Qualifier)
in scheme: JVR
preferred label: législation et jurisprudence (Qualificatif) @fr
scope note: Used for laws, statutes, ordinances, or government regulations, as well as for legal controversy and court decisions.
scope note: S'emploie pour les lois, les règlements, les décrets et les arrêtés gouvernementaux, ainsi que pour les controverses juridiques et les décisions judiciaires. @fr